FREEZING INDEX
type: Concept
change note: 2013-10-11 17:42:11.0 [saritz] added new definition insert Definition (id: null text: (Also called "coldness sun.") As used by the U. S. Army Corps of Engineers, the number of Fahrenheit degree-days (above and below 32°F) between the highest and lowest points on the cumulative degree-days time curve for one freezing season. language code: en);
change note: 2013-09-04 15:55:54.0 [epneff] Insert Concept add broader relation (FREEZING INDEX [2329bf96-d927-4993-95f9-93551d787ad7,105819] - ATMOSPHERIC TEMPERATURE INDICES [25d73bcf-c8d4-4c0e-ac98-8f3e98677e73,105815]);
definition: (Also called "coldness sun.") As used by the U. S. Army Corps of Engineers, the number of Fahrenheit degree-days (above and below 32°F) between the highest and lowest points on the cumulative degree-days time curve for one freezing season.
in scheme: sciencekeywords

ATMOSPHERIC TEMPERATURE INDICES
type: Concept