PHYTOPLANKTON
type: Concept
change note: 2017-03-15 11:27:47.0 [mgenazzi] Definition updated update Definition ("Phytoplankton is the plant portion of the plankton, the plant community in marine and freshwater situations, that floats free in the water and contains many species of algae and diatoms.); update Definition (Krebs, Charles K. Ecology - 4th ed. 1994. HarperCollins College Publishers, New York, New York. );
definition: "Phytoplankton is the plant portion of the plankton, the plant community in marine and freshwater situations, that floats free in the water and contains many species of algae and diatoms.
in scheme: sciencekeywords

PLANKTON
type: Concept