R/V MILLER FREEMAN
type: Concept
change note: 2021-11-18 09:27:09.0 [tstevens] Move Concepts delete broader relation (null); add broader relation (R/V MILLER FREEMAN [2405ed08-fc64-4251-a242-c879181ebafd,826071] - Surface [59b97a6c-385e-40a2-8422-ecbdb6023c4c,835900]);
definition: Miller Freeman is a 215-foot fisheries and oceanographic research vessel and is one of the largest research trawlers in the United States. Miller Freeman's primary mission is to provide a working platform for the study of the ocean's living resources. Miller Freeman is homeported at the Marine Operations Center-Pacific in Newport, Oregon. With a 12,578 mile / 31 day endurance, Miller Freeman is capable of operating in any waters of the world. Group: Platform_Details Entry_ID: R/V MILLER FREEMAN Group: Platform_Identification Platform_Category: In Situ Ocean-based Platforms Platform_Series_or_Entity: SHIPS Short_Name: R/V MILLER FREEMAN End_Group Creation_Date: 2012-07-19 Online_Resource: http://www.moc.noaa.gov/mf/ Sample_Image: http://www.moc.noaa.gov/mf/mfunderway.jpg End_Group
in scheme: platforms

Surface
type: Concept