INTUTE/SCIENCES
type: Concept
definition: Intute: Science, Engineering and Technology offers a free, easy to use and powerful tool for discovering the best Internet resources for teaching, learning and research, covering the physical sciences, engineering, computing, geography, mathematics and environmental science. Summary Provided By: http://www.intute.ac.uk/sciences/about.html
in scheme: providers

CONSORTIA/INSTITUTIONS
type: Concept