EE/EADC
type: Concept
definition: Estonian Antarctic Expeditions, a newly formed institution responsible for the logistics of all Antarctic activities, has submitted a preliminary environmental impact assessment (Environmental Memorandum according to Estonian legislation) of the planned research station to the Ministry of Environment where this is currently reviewed according to the Protocol and Estonian legislation. The results will be made available to all interested Parties as soon as possible. Summary provided by http://www.gi.ee/antarktika/
in scheme: providers

ESTONIA
type: Concept