UEA/SES/SOLAS
type: Concept
definition: he International SOLAS (Surface Ocean - Lower Atmosphere Study) Project is an international research initiative comprising of over 1500 scientists in 23 countries. The SOLAS International Project Office (IPO) is based in Norwich in the United Kingdom, and the IPO coordinates and communicates with research teams all over the world. Summary Provided By: http://www.uea.ac.uk/env/solas/aboutsolas/aboutsolas.html
in scheme: providers

ACADEMIC
type: Concept