SUSPENSION
type: Concept
change note: 2013-08-15 14:02:26.0 [tbs1979] insert Definition (id: null text: A heterogeneous fluid containing solid particles that are sufficiently large for sedimentation. language code: en);
change note: 2013-08-05 12:45:08.0 [tbs1979] Insert Concept add broader relation (SUSPENSION [26352dff-a48b-4b4a-a442-3b5039cf55c0,105373] - FLUVIAL PROCESSES [4b982bef-56fe-41e9-a131-af575a8fec6a,84331]);
definition: A heterogeneous fluid containing solid particles that are sufficiently large for sedimentation.
in scheme: sciencekeywords

FLUVIAL PROCESSES
type: Concept