A - C
type: Concept

AMSRICE06
type: Concept
definition: The AMSRIce06 campaign, headed by Don Cavalieri, was conducted over a one-week period in March 2006. Joint ground and aircraft measurements of snow and sea ice were taken over the Chukchi and Beaufort Seas of the Arctic Ocean. The objectives of the experiment were to compare field, airborne, and other satellite data in order to validate and improve existing snow depth on sea ice retrieval algorithms for the AMSR-E instrument. For more information and campaign maps, visit <http://polynya.gsfc.nasa.gov/seaice_arctic2006.html> the Goddard Space Flight Center (GSFC) Sea Ice Remote Sensing: Arctic 2006 Web page. http://nsidc.org/data/amsr_validation/cryosphere/amsrice06/index.html
in scheme: projects