CARBON DIOXIDE
type: Concept
change note: 2021-10-19 12:41:36.0 [tstevens] Insert Concept add narrower relation (CARBON DIOXIDE [26afa886-4866-4536-be3a-6f9db9aacd97,776170] - CARBON DIOXIDE PARTIAL PRESSURE [6bf8c40d-6bc0-410b-92a5-349bd88dc021,778204]);
definition: A gaseous compound of one carbon atom and two oxygen atoms, CO2. It is colorless, odorless, incombustible, and is soluble in water. Its dissolution in seawater is important to understanding the global carbon cycle.
in scheme: sciencekeywords

CARBON DIOXIDE PARTIAL PRESSURE
type: Concept

OCEAN CHEMISTRY
type: Concept