MACROCLIMATE
type: Concept
change note: 2020-05-11 15:38:50.0 [tstevens] Insert Concept add broader relation (MACROCLIMATE [273973f1-ccc5-4ae8-9872-17e249023c53,560101] - REGIONAL CLIMATE LEVELS [83ec2082-64bb-48d7-bcd2-454f082d608e,560089]);
definition: The general large-scale climate of a large area or country, as distinguished from the mesoclimate and microclimate.
in scheme: sciencekeywords

REGIONAL CLIMATE LEVELS
type: Concept