NTHMP
type: Concept
definition: The National Tsunami Hazard Mitigation Program is a program designed to reduce the impact of tsunamis through hazard assessment, warning guidance, and mitigation. Information about tsunami detection buoys can be found through the Deep-ocean Assessment and Reporting of Tsunamis project DART. Real-time data access for the DART buoys, US Earthquake (USGS), and NTHMP seismic waveforms is available. Other services and data products can be found at the NOAA Center for Tsunami Research. Information provided by (http://nthmp-history.pmel.noaa.gov/)
in scheme: projects

M - O
type: Concept