TOHOKU/PAT
type: Concept
definition: We are an international society established since 2003; formed by like-minded individuals to promote geophysical science and public benefits for Asia and Oceania. Our society participates actively and advances in this field through publication of international journals and developing close connections with local and regional societies. We strive to remain in touch with and contribute to the geophysical world community through cooperation with EGS, AGU and IUGG. Summary Provided By: http://www.asiaoceania.org/society/public.asp?bg=aogs&page=aboutus.htm
in scheme: providers

ACADEMIC
type: Concept