PHYTOPLANKTON
type: Concept
change note: 2017-03-15 11:28:35.0 [mgenazzi] Definition added insert Definition (id: null text: "Phytoplankton is the plant portion of the plankton, the plant community in marine and freshwater situations, that floats free in the water and contains many species of algae and diatoms. language code: en);
definition: "Phytoplankton is the plant portion of the plankton, the plant community in marine and freshwater situations, that floats free in the water and contains many species of algae and diatoms.
in scheme: sciencekeywords

PLANKTON
type: Concept