NASA/JPL/ISSM
type: Concept
definition: ISSM is the result of a collaboration between the Jet Propulsion Laboratory and University of California at Irvine. Its purpose is to tackle the challenge of modeling the evolution of the polar ice caps in Greenland and Antarctica. ISSM is funded by the NASA Cryosphere and MAP (Modeling Analysis and Prediction) programs, JPL R&TD (Research, Technology and Developmnt) and NSF. Our main collaborators are: MSSMat Laboratory of École Centrale Paris and the Department of Geology of University of Buffalo, NY.
in scheme: providers

NASA
type: Concept