P-3A ORION
type: Concept
alternative label: P-3A
change note: 2014-03-13 05:57:10.0 [aaleman] Insert Concept add broader relation (P-3A ORION [29564e60-e0d6-4d5d-9999-97b9cd16a034,106229] - Aircraft [227d9c3d-f631-402d-84ed-b8c5a562fc27,73411]);
change note: 2014-03-13 05:58:00.0 [aaleman] added new platform insert AltLabel (id: null text: Lockheed P-3A Orion language code: en);
change note: 2021-11-17 13:35:20.0 [tstevens] Move Concepts delete broader relation (null); add broader relation (P-3A ORION [29564e60-e0d6-4d5d-9999-97b9cd16a034,826083] - Propeller [6175c78e-432c-4254-b442-40d3cf0f6b34,835882]);
change note: 2016-06-09 14:34:41.0 [epneff] added altLabel insert AltLabel (id: null text: P-3A language code: en);
definition: The P-3A ORION is the Chilean Armada P-3 aircraft used during the 2002, 2004 and 2008 NASA missions that included Airborne Topographic Mapper (ATM) instrument data used in the recent Level 4 IceBridge derived data product. Group: Platform_Details Entry_ID: P-3A ORION Group: Platform_Identification Platform_Category: Aircraft Short_Name: P-3A ORION Long_Name: Lockheed P-3A Orion End_Group Creation_Date: 2014-03-13 End_Group
in scheme: platforms

Propeller
type: Concept