ALIAS
type: Concept
definition: Aircraft Laser Infrared Absorption Spectrometer (ALIAS) is used for N2O, CH4, CO, HCl, NO2, and Water Isotopes H216O, HDO, H217O, and H218O on the ER-2 and WB-57 Aircraft.
in scheme: instruments

Lidar/Laser Spectrometers
type: Concept