STRESS
type: Concept
change note: 2013-03-08 13:23:19.0 [tbs1979] Move Concepts add broader relation (STRESS [29dbe37e-22e6-4d02-844f-60359fbbc130,64339] - PLATE TECTONICS [71e9bc66-6f8c-41ec-8b22-2fe390223639,64395]); delete broader relation (null);
definition: Pertaining to the pressure which builds-up in the Earth's crust due to external loading, such as from collision of tectonic plates, addition/removal of water, advancing or receding of glaciers, etc.
in scheme: sciencekeywords

PLATE TECTONICS
type: Concept