NOXP
type: Concept
change note: 2015-09-01 09:52:51.0 [gee-cee] Added long name, definition from GHRC insert AltLabel (id: null text: X-band Polarimetric Radar language code: en); insert Definition (id: null text: NOXP is a mobile Doppler radar that operates on a 3cm wavelength (X-Band). This wavelength is more sensitive to smaller particles than the longer wavelengths used by NOAA NWS radars, and is capable of detecting tiny water droplets or snowflakes language code: en);
change note: 2015-09-01 09:51:28.0 [gee-cee] Insert Concept add broader relation (NOXP [2a342947-dc41-4ea0-b0a4-ba68bb732657,158339] - Imaging Radars [824070fa-da29-40fa-ba17-f3d60584bd4d,145571]);
definition: NOXP is a mobile Doppler radar that operates on a 3cm wavelength (X-Band). This wavelength is more sensitive to smaller particles than the longer wavelengths used by NOAA NWS radars, and is capable of detecting tiny water droplets or snowflakes
in scheme: instruments

Imaging Radars
type: Concept