JPSS-3
type: Concept
change note: 2019-10-04 15:37:12.0 [sritz] update Definition (JPSS-3 is the fourth spacecraft within NOAA's next generation of polar-orbiting satellites. It is scheduled to launch in 2026. Benefiting from on the success of previous JPSS spacecrafts, JPSS-3 contains five similar instruments: (1) VIIRS, (2) CrIS, (3) ATMS, (4) OMPS-N, and (5) RBI. More Information: https://www.jpss.noaa.gov); update Definition (Source: NOAA JPSS, https://www.jpss.noaa.gov/mission_and_instruments.html);
change note: 2020-08-26 16:03:55.0 [sritz] insert WeightedRelation (id: null related concept uuid: 3ffc498c-f9fc-4468-898d-321bb0595071 relationship type: null relationship value: null generated by: null);
change note: 2016-07-19 15:05:54.0 [saritz] insert Definition (id: null text: JPSS-3 is the fourth spacecraft within NOAA's next generation of polar-orbiting satellites. It is scheduled to launch in 2026. Benefiting from on the success of previous JPSS spacecrafts, JPSS-3 contains five similar instruments: (1) VIIRS, (2) CrIS, (3) ATMS, (4) OMPS-N, and (5) RBI. language code: en);
change note: 2018-02-02 12:13:14.0 [sritz] insert WeightedRelation (id: null related concept uuid: de7e08db-86f1-4593-ba9e-288f9f7b063e relationship type: null relationship value: null generated by: null);
change note: 2020-10-06 09:27:52.0 [mmorahan] insert AltLabel (id: null category: primary text: Joint Polar Satellite System - 3 language code: en);
change note: 2018-01-30 17:12:49.0 [sritz] insert WeightedRelation (id: null related concept uuid: dd7c719e-5767-4ceb-b83a-66c1401dab4a relationship type: null relationship value: null generated by: null); insert WeightedRelation (id: null related concept uuid: 5ad54972-6d91-4860-aea4-7914fe7ef823 relationship type: null relationship value: null generated by: null); insert WeightedRelation (id: null related concept uuid: 9a68e783-b54c-41f2-82ce-da975af38359 relationship type: null relationship value: null generated by: null); insert WeightedRelation (id: null related concept uuid: 6af7a52e-094d-4ba7-9174-ed967260939c relationship type: null relationship value: null generated by: null);
change note: 2018-02-02 12:13:46.0 [sritz] update WeightedRelation (Platform-Instrument); update WeightedRelation (1);
change note: 2020-08-26 16:04:57.0 [sritz] update WeightedRelation (Platform-Instrument); update WeightedRelation (1.0);
change note: 2016-07-19 15:16:06.0 [saritz] update WeightedRelation (Similar); update WeightedRelation (1); update WeightedRelation (Similar); update WeightedRelation (1); update WeightedRelation (Similar); update WeightedRelation (1); update WeightedRelation (Similar); update WeightedRelation (1); update WeightedRelation (Similar); update WeightedRelation (1);
change note: 2016-07-19 15:07:51.0 [saritz] insert WeightedRelation (id: null related concept uuid: 043dc242-1014-4e9a-91ee-c472b791b026 relationship type: null relationship value: null generated by: null);
change note: 2016-07-19 14:46:51.0 [saritz] Insert Concept add broader relation (JPSS-3 [2ab4ba32-0bb3-4e4e-bac6-1ff4a3baf0df,247453] - Joint Polar Satellite System (JPSS) [5c2364ca-c01a-4f69-8808-282c3854b2f6,226695]);
change note: 2018-01-30 17:35:08.0 [sritz] delete WeightedRelation (null); insert WeightedRelation (id: null related concept uuid: 91923fed-61c3-4125-b69d-1eeccafce52c relationship type: null relationship value: null generated by: null);
change note: 2016-07-19 15:08:23.0 [saritz] insert WeightedRelation (id: null related concept uuid: 10adce36-ce10-4ae6-94f9-211911c7dd15 relationship type: null relationship value: null generated by: null);
change note: 2016-07-19 15:07:04.0 [saritz] insert WeightedRelation (id: null related concept uuid: 5c2364ca-c01a-4f69-8808-282c3854b2f6 relationship type: null relationship value: null generated by: null); insert WeightedRelation (id: null related concept uuid: 586db0b3-5f94-466e-b7c1-a2dbedc0c1fc relationship type: null relationship value: null generated by: null); insert WeightedRelation (id: null related concept uuid: 85a52725-e6a1-430a-8506-c08c59ef31c7 relationship type: null relationship value: null generated by: null);
definition: JPSS-3 is the fourth spacecraft within NOAA's next generation of polar-orbiting satellites. It is scheduled to launch in 2026. Benefiting from on the success of previous JPSS spacecrafts, JPSS-3 contains five similar instruments: (1) VIIRS, (2) CrIS, (3) ATMS, (4) OMPS-N, and (5) RBI. More Information: https://www.jpss.noaa.gov
in scheme: platforms

Joint Polar Satellite System (JPSS)
type: Concept