MIT/DEAPS/IL
type: Concept
change note: 2013-07-01 11:22:13.0 [aaleman] created new data center insert AltLabel (id: null text: Isotope Lab, Department of Earth, Atmospheric & Planetary Sciences, Massachusetts Institute of Technology language code: en);
change note: 2013-07-01 11:19:43.0 [aaleman] Insert Concept add broader relation (MIT/DEAPS/IL [2bc56328-ed6b-47de-846c-4afb42d36bb5,105249] - ACADEMIC [7700280b-68ee-4644-bf5e-84e7a6adf897,66467]);
definition: Our interests lie in interplay among atmosphere, rock, water and microbe. We apply stable isotope systems, in particular, multiple-sulfur isotope ratios to explore frontiers in isotope geochemistry. Our current research projects include, photochemical sulfur isotope effect, early microbial evolution, deep biosphere, and seafloor hydrothermal deposits. In addition, new project is starting under the NSF-MRI support to develop the state-of-the-art instrument for isotopomer monitoring of atmospheric nitrous oxide (with Ron Prinn of EPAS and Center of Global Change Science). Interested students are encouraged to inquire about potential research projects in the laboratory.
in scheme: providers

ACADEMIC
type: Concept