ATMOSPHERIC CIRCULATION RECONSTRUCTION
type: Concept
definition: Reconstruction of past atmospheric circulation conditions based on paleoclimate proxy records.
in scheme: sciencekeywords

PALEOCLIMATE RECONSTRUCTIONS
type: Concept