TSI DustTrak
type: Concept
change note: 2021-08-09 08:52:50.0 [tstevens] insert AltLabel (id: null category: primary text: TSI DustTrak Aerosol Monitor language code: en); insert Definition (id: null text: The DustTrak Aerosol Monitor measures aerosol contaminants such as dust, smoke, fumes and mists. language code: en);
change note: 2021-08-09 08:49:22.0 [tstevens] Insert Concept add broader relation (TSI DustTrak [2c5970fb-69a7-4701-a271-b4b211ed476b,706553] - Chemical Meters/Analyzers [3d25724b-832f-4a61-b0b2-4f2ccecdba94,698163]);
definition: The DustTrak Aerosol Monitor measures aerosol contaminants such as dust, smoke, fumes and mists.
in scheme: instruments

Chemical Meters/Analyzers
type: Concept