THEOS PAN
type: Concept
definition: THEOS PAN is an optical instrument with resolution 2 m and swath width at 22 km. It can be used in several applications such as cartography, land use planning and management, national security, etc. Group: Instrument_Details Entry_ID: THEOS PAN Group: Instrument_Identification Instrument_Category: Earth Remote Sensing Instruments Instrument_Class: Passive Remote Sensing Instrument_Type: Photon/Optical Detectors Instrument_Subtype: Cameras Short_Name: THEOS PAN Long_Name: THEOS Panchromatic Imager End_Group Group: Associated_Platforms Short_Name: THEOS End_Group Group: Spectral_Frequency_Information Wavelength_Keyword: VISIBLE Spectral_Frequency_Coverage_Range: 0.45 - 0.90 µm End_Group Creation_Date: 2011-08-18 Group: Instrument_Logistics Instrument_Start_Date: 2008-10-01 Instrument_Owner: GISTDA End_Group End_Group
in scheme: instruments

Cameras
type: Concept