Elektro-L N3
type: Concept
alternative label: Elektro-L No.3
change note: 2019-12-31 12:31:49.0 [sritz] update Definition (3rd flight unit of the Electro-L series. Mission: operational meteorology. Substantial contribution to space weather. Launch Date: 2019-12-24 More Information: https://www.wmo-sat.info/oscar/satellites/view/474);
change note: 2019-12-31 12:36:54.0 [sritz] update Definition (3rd flight unit of the Electro-L series. Mission: operational meteorology. Substantial contribution to space weather. Launch Date: 2019-12-24 More Information: https://www.wmo-sat.info/oscar/satellites/view/474 https://www.nasaspaceflight.com/2019/12/russian-proton-m-new-geostationary-weather-satellite/);
change note: 2019-12-31 12:24:56.0 [sritz] Insert Concept add broader relation (Elektro-L N3 [2c780dff-fce3-4625-8b89-a7cd2d64d6ec,559585] - Elektro-L [882c16a9-0bc6-4773-8066-e25ea8de3c9d,559581]);
change note: 2019-12-31 12:29:24.0 [sritz] insert AltLabel (id: null category: null text: Elektro-L No.3 language code: en); insert Definition (id: null text: https://www.wmo-sat.info/oscar/satellites/view/474 language code: en);
change note: 2019-12-31 12:30:35.0 [sritz] update Definition (3rd flight unit of the Electro-L series. Mission: operational meteorology. Substantial contribution to space weather. More Information: https://www.wmo-sat.info/oscar/satellites/view/474);
definition: 3rd flight unit of the Electro-L series. Mission: operational meteorology. Substantial contribution to space weather. Launch Date: 2019-12-24 More Information: https://www.wmo-sat.info/oscar/satellites/view/474 https://www.nasaspaceflight.com/2019/12/russian-proton-m-new-geostationary-weather-satellite/
in scheme: platforms

Elektro-L
type: Concept