RECHARGE AMOUNT
type: Concept
change note: 2016-04-04 09:48:54.0 [gee-cee] update Definition (Amount of water needed to replenish ground water.);
change note: 2016-03-31 09:59:22.0 [gee-cee] insert Definition (id: null text: Amount of water needed to replenish ground water language code: en);
change note: 2016-03-31 09:58:25.0 [gee-cee] Insert Concept add broader relation (RECHARGE AMOUNT [2cd0b33e-4805-4930-ba84-fef6c625a9b4,158777] - AQUIFER RECHARGE [dbeaaf9f-294c-4e45-ba9e-7be8cd449db1,158775]);
definition: Amount of water needed to replenish ground water.
in scheme: sciencekeywords

AQUIFER RECHARGE
type: Concept