TRACE ELEMENTS/TRACE METALS
type: Concept
definition: Trace elements are elements that occur in minute quantities. Trace elements can include copper, silicon, cobalt, iron, zinc, iodine, and manganese.
in scheme: sciencekeywords

ATMOSPHERIC CHEMISTRY
type: Concept