NASA/GSFC/SED/ESD/TISL/MODAPS
type: Concept
change note: 2018-08-10 13:18:36.0 [sritz] insert Definition (id: null text: The MODIS Adaptive Processing System (MODAPS) which is part of NASA's GSFC Terrestrial Information Systems Laboratory, Code 614.5, operates the LANCE-MODIS data system. LAADS-MODIS generates Aqua and Terra MODIS L0, L1, L2, L2G, L3 and L4 products. language code: en);
change note: 2018-08-10 13:15:38.0 [sritz] Insert Concept add broader relation (NASA/GSFC/SED/ESD/TISL/MODAPS [2da1e589-35e6-4ec7-87ec-46dffc611f8e,368055] - NASA [4fd0aa9d-1a80-4dde-8452-c69b5c4d08cc,337191]);
change note: 2018-08-10 13:17:46.0 [sritz] insert AltLabel (id: null category: primary text: MODIS Adaptive Processing System, Terrestrial Information Systems Laboratory, Earth Sciences Division, Science and Exploration Directorate, Goddard Space Flight Center, NASA language code: en);
change note: 2018-08-10 13:23:36.0 [sritz] insert Resource (id: null type: provider url: https://modaps.modaps.eosdis.nasa.gov/);
definition: The MODIS Adaptive Processing System (MODAPS) which is part of NASA's GSFC Terrestrial Information Systems Laboratory, Code 614.5, operates the LANCE-MODIS data system. LAADS-MODIS generates Aqua and Terra MODIS L0, L1, L2, L2G, L3 and L4 products.
in scheme: providers

NASA
type: Concept