ILRDSS
type: Concept
definition: The Illinois Rivers Decision Support System in partnership with the Illinois Rivers 2020 Program assists decision makers with issues related to habitat, restoration, floodplain, management, navigation, sedimentation, and water quality of the Illinois River and its backwaters. Informaation provided on their website includes access to geospatial data and map services, models, various publications, detailed information on research programs associated with the Illinois River, and various other information associated with the Illinois River. Additional information availabel at "http://ilrdss.sws.uiuc.edu/default.asp"
in scheme: projects

G - I
type: Concept