USDA/NRCS/NSERL
type: Concept
definition: The National Soil Erosion Research Laboratory (NSERL) is the focal point for the U.S. Government's national research program in soil erosion by water. The lab is in the Midwest Area of the USDA-ARS. Major program thrusts of the NSERL include fundamental erosion process research, erosion control research, and delivery of improved erosion prediction technology. The NSERL is located on the campus of Purdue University (building labeled SOIL in south center of map) in West Lafayette, Indiana. This modern facility houses over twenty scientists and support staff, and is equipped with a large indoor hydraulics laboratory, portable rainfall simulators for field experimentation, as well as extensive computer and laboratory equipment. Summary provided by: http://www.ars.usda.gov/main/site_main.htm?modecode=36021500
in scheme: providers

USDA
type: Concept