CYCADS
type: Concept
change note: 2017-03-15 11:11:26.0 [mgenazzi] Definition added insert Definition (id: null text: Division Cycadophyta. Plants resembling palms with a ligneous trunk, stiff evergreen pinnate leaves. language code: en);
definition: Division Cycadophyta. Plants resembling palms with a ligneous trunk, stiff evergreen pinnate leaves.
in scheme: sciencekeywords

GYMNOSPERMS
type: Concept