CAR
type: Concept
change note: 2017-05-02 14:15:25.0 [tstevens] insert AltLabel (id: null text: Cloud Absorption Radiometer language code: en); insert Definition (id: null text: The Cloud Absorption Radiometer (CAR) is an airborne multi-wavelength scanning radiometer that can perform several functions including determining the single scattering albedo of clouds at selected wavelengths in the visible and near-infrared; measuring the angular distribution of scattered radiation; measuring bidirectional reflectance of various surface types; and acquiring imagery of cloud and Earth surface features. language code: en);
change note: 2017-05-02 14:14:36.0 [tstevens] Insert Concept add broader relation (CAR [2ee6a227-a510-4dcd-8068-3e0ad14ede9b,309559] - Radiometers [5b753e40-b3f1-426a-8d92-ffee1d675468,289971]);
definition: The Cloud Absorption Radiometer (CAR) is an airborne multi-wavelength scanning radiometer that can perform several functions including determining the single scattering albedo of clouds at selected wavelengths in the visible and near-infrared; measuring the angular distribution of scattered radiation; measuring bidirectional reflectance of various surface types; and acquiring imagery of cloud and Earth surface features.
in scheme: instruments

Radiometers
type: Concept