HOURLY PRECIPITATION AMOUNT
type: Concept
change note: 2014-04-15 09:53:56.0 [128.183.164.42] added definition insert Definition (id: null text: The amount of precipitation collected and measured per hour at a weather observing site. language code: en);
change note: 2014-04-14 14:25:00.0 [128.183.164.42] Insert Concept add broader relation (HOURLY PRECIPITATION AMOUNT [2f0f103a-4fe9-429f-a783-ba1d6e6a446a,106313] - PRECIPITATION AMOUNT [cad5c02a-e771-434e-bef6-8dced38a68e8,84205]);
definition: The amount of precipitation collected and measured per hour at a weather observing site.
in scheme: sciencekeywords

PRECIPITATION AMOUNT
type: Concept