WPTI
type: Concept
definition: WPTI Telecom LLC (WPTI) is a rapidly growing wholesale provider of broadband network and telecommunications services. The company focuses on specialized connectivity and Internet Technologies, including Digital Subscriber Line (DSL), Wireless, Virtual Private Networks (VPN's) and the latest Web technologies. WPTI's network services provide cost effective solutions to Internet Service Providers (ISPs) and large end users in the Western United States. WPTI has been granted a Certificate of Public Convenience and Necessity to operate as a Competitive Local Exchange Carrier (CLEC) in the state of Nevada and is providing dedicated digital telephone services in Northern Nevada. Similar services will be also be offered in Southern Nevada by the end of this year. Summary provided by http://www.wpti.net/
in scheme: providers

NON-GOVERNMENT/NON-PROFIT ORGANIZATIONS
type: Concept