USDA/NRCS/ALASKA
type: Concept
definition: The Alaska Division of the Natural Resources Conservation Service provides support to help people conserve, maintain, and improve our natural resources and environment within Alaska. Website: "http://www.ak.nrcs.usda.gov/" [Summary provided by the USDA.]
in scheme: providers

USDA
type: Concept