DOC/NOAA/EDU
type: Concept
change note: 2022-11-03 16:45:37.0 [sritz] update Resource (provider); update Resource (https://www.noaa.gov/education);
change note: 2022-11-03 16:46:15.0 [sritz] update Definition (NOAA's many educational activities are distributed across the agency. This site has been designed to help students, teachers, librarians and the general public access the many educational activities, publications, and booklets that have been produced. Summary provided by https://www.noaa.gov/education); update Definition (https://www.noaa.gov/education);
definition: NOAA's many educational activities are distributed across the agency. This site has been designed to help students, teachers, librarians and the general public access the many educational activities, publications, and booklets that have been produced. Summary provided by https://www.noaa.gov/education
in scheme: providers

NOAA
type: Concept