Permanent Land Sites
type: Concept

MESONET
type: Concept
change note: 2022-02-11 09:01:07.0 [tstevens] update Definition (Mesoscale Meteorological Network (MESONET) are world-class network of environmental monitoring stations that gather current meteorological observations and send the data to their corresponding centers.); update Resource (image);
change note: 2021-11-17 14:05:43.0 [tstevens] Move Concepts delete broader relation (null); add broader relation (MESONET [3232dc8a-d223-4df2-b64a-4bd4fb632f9e,826115] - Permanent Land Sites [0ec10fd9-492c-498a-b6d8-e2840cc3643b,835887]);
definition: Mesoscale Meteorological Network (MESONET) are world-class network of environmental monitoring stations that gather current meteorological observations and send the data to their corresponding centers.
in scheme: platforms