LAT
type: Concept
definition: LAT baseline design for the GLAST tracker consists of a four-by-four array of tower modules. Each tower module consists of interleaved planes of silicon-strip detectors and tracker tungsten converter sheets. Silicon-strip detectors are able to more precisely track the electron or positron produced from the initial gamma-ray than previous types of detectors. SSDs will have the ability to determine the location of an object in the sky to within 0.5 to 5 arc minutes. The pair conversion signature is also used to help reject the much larger background of charged cosmic rays. The high intrinsic efficiency and reliability of this technology enables straight forward event reconstruction and excellent resolution with small tails. These ease-of-use properties will maximize the mission science return for guest observers. Summary provided by http://www-glast.stanford.edu/Instrument.html Group: Instrument_Details Entry_ID: LAT Group: Instrument_Identification Instrument_Category: Solar/Space Observing Instruments Instrument_Class: Photon/Optical Detectors Instrument_Type: Telescopes Short_Name: LAT Long_Name: Large Area Telescope End_Group Group: Associated_Platforms Short_Name: FERMI End_Group Online_Resource: http://www-glast.stanford.edu/Instrument.html Sample_Image: http://www-glast.stanford.edu/images/glast2close.jpg Creation_Date: 2009-10-07 End_Group
in scheme: instruments

Telescopes
type: Concept