URG-9000D AIM
type: Concept
change note: 2021-05-12 09:00:39.0 [tstevens] insert AltLabel (id: null category: primary text: URG-9000D Ambient Ion Monitor language code: en); insert Definition (id: null text: The URG-9000D Ambient Ion Monitor (AIM) is a scientifically-advanced, multi-pollutant monitoring method which allows for continuous measurements of particle sulfate, nitrate, ammonium, chloride, potassium, magnesium, calcium and sodium. At the same time, the AIM provides time-resolved gas measurements of sulfur-dioxide, nitric acid and ammonia. language code: en);
change note: 2021-05-12 08:59:39.0 [tstevens] Insert Concept add broader relation (URG-9000D AIM [3433869d-37b6-4dd8-b618-614979bf6f2e,606928] - Chemical Meters/Analyzers [3d25724b-832f-4a61-b0b2-4f2ccecdba94,598603]);
definition: The URG-9000D Ambient Ion Monitor (AIM) is a scientifically-advanced, multi-pollutant monitoring method which allows for continuous measurements of particle sulfate, nitrate, ammonium, chloride, potassium, magnesium, calcium and sodium. At the same time, the AIM provides time-resolved gas measurements of sulfur-dioxide, nitric acid and ammonia.
in scheme: instruments

Chemical Meters/Analyzers
type: Concept