SHORELINES
type: Concept

SHORELINE MAPPING
type: Concept
change note: 2021-10-19 08:35:00.0 [tstevens] insert Definition (id: null text: Large-scale maps and nautical charts required to properly depict shoreline, shoreline features, navigation aids, and other navigationally significant features such as piers, docks, pilings, etc. These maps are compiled from remotely sensed data such as aerial photographs, LIDAR or satellite imagery. language code: en);
change note: 2021-10-19 08:33:57.0 [tstevens] Insert Concept add broader relation (SHORELINE MAPPING [3472f70b-874f-4dc5-87db-4b3ebc4b9aaa,778189] - SHORELINES [1d3b4eb7-9931-44bf-8457-26847051b7a8,775034]);
definition: Large-scale maps and nautical charts required to properly depict shoreline, shoreline features, navigation aids, and other navigationally significant features such as piers, docks, pilings, etc. These maps are compiled from remotely sensed data such as aerial photographs, LIDAR or satellite imagery.
in scheme: sciencekeywords