PIONEER 7
type: Concept
change note: 2021-12-01 12:47:19.0 [tstevens] Move Concepts delete broader relation (null); add broader relation (PIONEER 7 [35fa31c4-a259-4b5d-82e0-48b5bdddd13a,826127] - Pioneer [7c63ec87-b637-492f-8650-ef7a7bcf1b9f,835931]);
definition: Identical to Pioneer 6, Pioneer 7 was put into heliocentric orbit at 0.814 x 0.985 AU to study the solar magnetic field, the solar wind, and cosmic rays at widely separated points in solar orbit. On 7 September 1968, the spacecraft was correctly aligned with the Sun and Earth to begin studying Earth's magnetic tail. In 1977, eleven years after its launch, Pioneer 7 registered the magnetic tail 19.3 million kilometers out, three times further into space than recorded previously. On 20 March 1986, the spacecraft flew within 12.3 million kilometers of Halley's Comet and monitored the interaction between the cometary hydrogen tail and the solar wind. As with Pioneer 6 and Pioneer 8, NASA continues to maintain intermittent contact with Pioneer 7, more than thirty years after its mission began. On 31 March 1995, for example, the plasma analyzer was turned on during 2 hours of contact with the ground. Information provided by http://solarsystem.nasa.gov/missions/profile.cfm?Sort=Alpha&Alias=Pioneer%207&Letter=P&Display=ReadMore Group: Platform_Details Entry_ID: PIONEER 7 Group: Platform_Identification Platform_Category: Solar/Space Observation Satellites Short_Name: PIONEER 7 End_Group Group: Platform_Associated_Instruments Short_Name: FLUXGATE MAGNETOMETERS Short_Name: PROBES End_Group Creation_Date: 2007-08-20 Online_Resource: http://solarsystem.nasa.gov/missions/profile.cfm?Sort=Alpha&Letter=P&Alias=Pioneer%207 Sample_Image: http://solarsystem.nasa.gov/missions/images/miss-pioneer_07.gif Group: Platform_Logistics Launch_Date: 1966-08-17 Primary_Sponsor: NASA End_Group End_Group
in scheme: platforms

Pioneer
type: Concept