COMMERCIAL
type: Concept

GEOANAL
type: Concept
definition: The application of mathematics and technology to geographically related data, includes such fields as Geodesy, Remote Sensing, Cartography, GIS, and Surveying. Summary Provided By: http://www.geoanalytic.com/
in scheme: providers