CHLOROPHYLL
type: Concept
change note: 2017-03-15 11:59:32.0 [mgenazzi] Definition updated update Definition (Chlorophyll is the green pigment in plants responsible for absorbing the light energy required for photosynthesis.); update Definition (Nebel, Bernard J.and Richard T. Wright. Environmental Science-the Way the World Works. 1998. Prentice-Hall, Inc. Upper Saddle River, New Jersey. );
definition: Chlorophyll is the green pigment in plants responsible for absorbing the light energy required for photosynthesis.
in scheme: sciencekeywords

PIGMENTS
type: Concept