JP/NIES
type: Concept
change note: 2013-12-19 15:07:32.0 [mpmorahan] insert AltLabel (id: null text: National Institute for Environmental Studies, Japan language code: en);
change note: 2013-12-19 15:05:22.0 [mpmorahan] Rename Concept update PrefLabel (JP/NIES);
change note: 2013-12-19 15:02:45.0 [mpmorahan] Insert Concept add broader relation (NIES [3851f38d-312c-4c58-917f-c7b48ab66a15,106049] - JAPAN [f5d1252b-e0cd-4c19-9c43-69c7ea65e14d,66475]);
definition: The National Institute for Environmental Studies (NIES) is a research institute that plays a central role in Japan in addressing environmental issues, by covering a wide range of research fields in an integrated way, and from local to global levels. Researchers from diverse fields of expertise carry out interdisciplinary work, ranging from basic research to research aimed at addressing complex environmental issues.
in scheme: providers

JAPAN
type: Concept