GHGSat-C1
type: Concept
change note: 2020-06-25 08:27:24.0 [mmorahan] insert AltLabel (id: null category: primary text: Greenhouse Gas Satellite - C1 language code: en);
change note: 2020-06-25 10:56:42.0 [mmorahan] update Definition (In order to expand satellite system capacity after the successful launch of its demonstration satellite, GHGSat started the design of two (2) additional high-resolution satelltes in January 2017, called GHGSat-C1 ("Iris") and GHGSat-C2 ("Hugo"), respectively. GHGSat-C1/-C2 are intended to have similar designs to GHGSat-D, while applying critical lessons learned to improve performance.);
change note: 2020-06-25 12:05:49.0 [mmorahan] update Definition (https://www.ghgsat.com/our-platforms/iris/ https://directory.eoportal.org/web/eoportal/satellite-missions/g/ghgsat-c1-c2);
change note: 2020-06-25 10:52:20.0 [mmorahan]
change note: 2020-06-25 08:23:40.0 [mmorahan] Insert Concept add broader relation (GHGSat-C1 [38a680f5-6c96-490d-9683-8c5588090e34,560486] - GHGSat [82823ffa-e4d5-4877-bf0a-b9eb5b8c1108,560482]);
change note: 2020-06-25 10:56:22.0 [mmorahan] update Definition (In order to expand satellite system capacity after the successful launch of its demonstration satellite, GHGSat started the design of two (2) additional high-resolution satelltes in January 2017, called GHGSat-C1 ("Iris") and GHGSat-C2 ("Hugo"), respectively. GHGSat-C1/-C2 are intended to have similar designs to GHGSat-D, while applying critical lessons learned to improve performance..);
change note: 2020-06-25 10:57:28.0 [mmorahan] update Definition (In order to expand satellite system capacity after the successful launch of its demonstration satellite, GHGSat started the design of two (2) additional high-resolution satellites in January 2017, called GHGSat-C1 ("Iris") and GHGSat-C2 ("Hugo"), respectively. GHGSat-C1/-C2 are intended to have similar designs to GHGSat-D, while applying critical lessons learned to improve performance.);
change note: 2020-06-25 10:54:54.0 [mmorahan] insert Definition (id: null text: In order to expand satellite system capacity after the successful launch of its demonstration satellite, GHGSat started the design of two (2) additional high-resolution satellites in January 2017, called GHGSat-C1 ("Iris") and GHGSat-C2 ("Hugo"), respectively. GHGSat-C1/-C2 are intended to have similar designs to GHGSat-D, while applying critical lessons learned to improve performance. language code: en);
change note: 2020-06-25 16:27:49.0 [mmorahan] insert WeightedRelation (id: null related concept uuid: 28a3ae40-6383-47e3-a1b8-a9f6503c5fd5 relationship type: null relationship value: null generated by: null);
definition: In order to expand satellite system capacity after the successful launch of its demonstration satellite, GHGSat started the design of two (2) additional high-resolution satellites in January 2017, called GHGSat-C1 ("Iris") and GHGSat-C2 ("Hugo"), respectively. GHGSat-C1/-C2 are intended to have similar designs to GHGSat-D, while applying critical lessons learned to improve performance.
in scheme: platforms

GHGSat
type: Concept