STABLE ISOTOPES
type: Concept
definition: Any non-radioactive form of a chemical element, having the same atomic weight as that element (i.e. same number of protons), but a different number of neutrons.
in scheme: sciencekeywords

OCEAN CHEMISTRY
type: Concept