CARBON MONOXIDE SURFACE
type: Concept
change note: 2021-03-02 09:38:00.0 [tstevens] insert Definition (id: null text: Measurement of Carbon Monoxide gas at the surface of the earth. language code: en);
change note: 2021-02-26 08:59:06.0 [tstevens] Insert Concept add broader relation (CARBON MONOXIDE SURFACE [3965bb3f-fa0e-475e-a48c-5703c9ab9fe5,560868] - ATMOSPHERIC CARBON MONOXIDE [88a1b416-1589-45a4-9923-452975ec35c7,83949]);
definition: Measurement of Carbon Monoxide gas at the surface of the earth.
in scheme: sciencekeywords

ATMOSPHERIC CARBON MONOXIDE
type: Concept