GLACIER REFREEZE
type: Concept
change note: 2023-04-03 18:26:05.0 [tstevens] insert Definition (id: null text: Mass gained by a glacier due to refreezing language code: en);
change note: 2023-04-03 18:25:36.0 [tstevens] Insert Concept add broader relation (GLACIER REFREEZE [399025f7-315e-47db-af48-67771318a70b,1276531] - GLACIERS [68eed887-8008-4352-b420-949457ab59ab,1273524]);
definition: Mass gained by a glacier due to refreezing
in scheme: sciencekeywords

GLACIERS
type: Concept