Spectrometers
type: Concept

EB SPECTROMETER
type: Concept
definition: The EB SPECTROMETER ? Ebert-Fastie Spectrometer was designed to make measurements of UV spectrum of the earth in the wavelength range from 1100 to 3400 A, with a 20-A resolution. [Summary provided by NASA]
in scheme: instruments