BIOLOGICAL HAZARDS MAPPING
type: Concept
alternative label: BIOHAZARDS MAPPING
change note: 2019-07-25 09:07:23.0 [tstevens] Insert Concept add broader relation (BIOLOGICAL HAZARDS MAPPING [39a63377-02d8-41a7-814a-41ea7db700c9,368983] - HAZARD MAPPING [c9a13e09-98de-4ace-8d4c-b01aa04347f4,368979]);
definition: Mapping of ​hazards caused by exposure to living organisms and their toxic substances (e.g., venom, mold) or vector-borne diseases that they may carry. Examples are venomous wildlife and insects, poisonous plants, and mosquitoes carrying disease-causing agents such as parasites, bacteria, or viruses (e.g., malaria).
in scheme: sciencekeywords

HAZARD MAPPING
type: Concept