NYU/CIMS/CAOS
type: Concept
definition: The Center for Atmospheric Ocean Science at New York University provides training and research in applied mathematics, dynamical meteorology, physical oceanography, and climate system modeling. Website: http://caos.cims.nyu.edu/page/home [Summary provided by New York University.]
in scheme: providers

ACADEMIC
type: Concept